Re: 'URISyntaxException: Illegal character in path' on square brackets

Splash Forums PrettyFaces Users 'URISyntaxException: Illegal character in path' on square brackets Re: 'URISyntaxException: Illegal character in path' on square brackets

#21833

ecive
Member

Thanks, I did get the master initially.

Now with the 3.x branch I get test failures.

robert@pferdeapfel:~> git clone -b 3.x git://github.com/ocpsoft/prettyfaces.git

Cloning into ‘prettyfaces’…

remote: Counting objects: 6024, done.

remote: Compressing objects: 100% (2500/2500), done.

remote: Total 6024 (delta 2471), reused 5696 (delta 2148)

Receiving objects: 100% (6024/6024), 913.35 KiB | 1.45 MiB/s, done.

Resolving deltas: 100% (2471/2471), done.

robert@pferdeapfel:~> cd prettyfaces/

robert@pferdeapfel:~/prettyfaces> git branch

* 3.x

robert@pferdeapfel:~/prettyfaces> mvn clean install

Results :

Tests in error:

com.ocpsoft.pretty.faces.test.rewrite.RewriteLoopTest

com.ocpsoft.pretty.faces.test.PathParametersTest

com.ocpsoft.pretty.faces.test.encoding.URLEncodingTest

com.ocpsoft.pretty.faces.test.interaction.RewriteEngineUrlMappingInteractionTest

com.ocpsoft.pretty.faces.test.mapping.SimpleMappingTest

com.ocpsoft.pretty.faces.test.redirect.URLRedirectTest

com.ocpsoft.pretty.faces.test.loop.InfiniteLoopTest

com.ocpsoft.pretty.faces.test.viewidmatch.ViewIdMatchTest

com.ocpsoft.pretty.faces.test.dynaview.ParameterizedDynaViewTest

com.ocpsoft.pretty.faces.test.PrettyContextTest

com.ocpsoft.pretty.faces.test.AmbiguousViewidTest

Tests run: 11, Failures: 0, Errors: 11, Skipped: 0

[INFO]


[INFO] Reactor Summary:

[INFO]

[INFO] PrettyFaces Parent ………………………….. SUCCESS [0.652s]

[INFO] PrettyFaces Core ……………………………. SUCCESS [8.882s]

[INFO] PrettyFaces JSF 1.1.x ……………………….. SUCCESS [5.580s]

[INFO] PrettyFaces JSF 1.2.x ……………………….. SUCCESS [1.852s]

[INFO] PrettyFaces JSF 2.0.x ……………………….. SUCCESS [2.783s]

[INFO] PrettyFaces JSF 2.0.x – Tests ………………… FAILURE [3.426s]

[INFO]


Do I need something else?

Robert