Re: 'URISyntaxException: Illegal character in path' on square brackets

Splash Forums PrettyFaces Users 'URISyntaxException: Illegal character in path' on square brackets Re: 'URISyntaxException: Illegal character in path' on square brackets

#21830

ecive
Member

How can I get that 3.3.4-SNAPSHOT?

I did not find a download link for it and building from source with mvn install fails. Looks like it’s missing dependencies:

[INFO] BUILD FAILURE

[INFO]


[INFO] Total time: 7.440s

[INFO] Finished at: Fri Feb 15 15:35:10 CST 2013

[INFO] Final Memory: 4M/81M

[INFO]


[ERROR] Failed to execute goal on project prettyfaces-test-harness: Could not resolve dependencies for project org.ocpsoft.prettyfaces:prettyfaces-test-harness:jar:4.0.0-SNAPSHOT: Could not find artifact org.ocpsoft.rewrite:rewrite-test-harness:jar:2.0.0-SNAPSHOT in JBOSS_NEXUS (http://repository.jboss.org/nexus/content/groups/public) -> [Help 1]

[ERROR]

What am I missing here (besides dependencies)?

Thanks,

Robert